{"text_format":"1","workbook":"xlsx","n_sheets":13,"sheets":["Security Settings","Information","Main-Land Bid Price","Feasibility","Sensitivity Tables","Cash Budgets","Cash Flows","5 Year Model","10 Year Model","30 Year Model","Cash Flow Chart","Yield Chart","Growth Chart"],"not_rendered":{"charts":8,"images":32,"macros":1,"external_links":0,"defined_names":226,"comments":0,"pivot_tables":0},"unopened":[{"sheet":"Cash Flow Chart","index":10,"reason":"not_a_worksheet"},{"sheet":"Yield Chart","index":11,"reason":"not_a_worksheet"},{"sheet":"Growth Chart","index":12,"reason":"not_a_worksheet"}],"bounds":{"document_bytes":16777216,"sheet_cells":100000,"rows_first":2000,"rows_last":500,"rows_between":2000,"halvings":0,"cell_chars":16384,"cell_head_chars":4096},"cells_cut":0,"cells_raw":0,"read":"whole","date_system":"1900"}

{"sheet":"Security Settings","index":0,"n_rows":73,"n_cols":4,"rows_kept":73,"cut":false,"hidden":false,"merged":[]}
[]
[]
[null,null,"Warning: Content Blocked!"]
[]
[null,null,"Your Excel security settings are currently blocking some of the features in this FAST spreadsheet."]
[null,null,"The default settings for Microsoft Excel 2003 (and previous versions) and Excel 2007 do not allow"]
[null,null,"Macros contained in this spreadsheet to function properly and need to be changed."]
[]
{"$rows_left_out":66}
{"sheet":"Information","index":1,"n_rows":41,"n_cols":16,"rows_kept":41,"cut":false,"hidden":false,"merged":[[48,4,50,4],[46,10,49,10],[3,5,5,10],[8,6,12,9],[21,11,22,12],[6,14,9,14],[3,11,5,11],[44,5,46,5],[18,6,22,9]]}
[]
[]
[]
[null,null,null,null,null,"Land Purchase Analysis"]
[]
[]
[]
[]
{"$rows_left_out":34}
{"sheet":"Main-Land Bid Price","index":2,"n_rows":30,"n_cols":36,"rows_kept":30,"cut":false,"hidden":false,"merged":[[16,3,16,4],[7,3,7,4],[10,3,10,4],[11,3,11,4],[12,3,12,4],[5,3,5,4],[6,3,6,4],[14,3,14,4],[15,3,15,4]]}
[null,"                     Real Estate Purchase Analysis",null,null,null,null,null,null,null,null,{"$f":"IF(ABS(K2-K3)<3.33333333333333E-07*Aprice,0,1)","v":0},null,null,null,null,null,null,null,null,null,null,null,null,null,null,null,3,1,"150% Declining Balance, half year",null,null,null,"Year","Rate","Depreciation","Remaining Basis"]
[null,"                          Used to determine the maximum bid price of a real estate investment opportunity and sensitivity to terms.",null,null,null,null,null,null,null,null,{"$f":"NPVRange","v":962.02176000000009},null,null,null,null,null,null,null,null,null,null,null,null,null,null,null,5,2,"200% Declining Balance, half year",null,null,null,1,0.1666666716337204,0]
[null,null,null,null,null,null,null,null,null,null,962.02178955078125,null,null,null,null,null,null,null,null,null,null,null,null,null,null,null,7,3,"Straight Line (half year)",null,null,null,2,0.33333332538604737,0]
[null,null,null,null,null,null,null,null,null,null,null,null,null,null,null,null,null,null,null,null,null,null,null,null,null,null,10,4,"Straight Line (full year)",null,null,null,3,0.33333332538604732,0]
[null,"Real Estate and Investment Information:",null," Financing Information:",null,null,null,null,null,null,null,null,null,null,null,null,null,null,null,null,null,null,null,null,null,null,12,null,null,null,null,null,4,0.16666666269302371,0]
[null,"  Analysis price",8000,"    Down payment (%)",null,0.25,null,null,null,null,null,null,null,null,null,null,null,null,null,null,null,null,null,null,null,null,15,null,"Straight Line (full year)"]
[null,"  Additional cash flows: year 1",350,"    Annual interest rate on loan (%)",null,0.06,null,null,null,null,null,null,null,null,null,null,null,null,null,null,null,null,null,null,null,null,20,null,{"$f":"MATCH(AC6,AC1:AC4,0)","v":4}]
[null," Optional: Enter specific cash flows ",null,"    Length of loan (years)",null,20,null,null,null,null,null,null,null,null,null,null,null,null,null,null,null,null,null,null,null,null,25,null,{"$f":"IF(AC7=1,1.5,IF(AC7=2,2,1))","v":1}]
{"$rows_left_out":23}
{"sheet":"Feasibility","index":3,"n_rows":114,"n_cols":22,"rows_kept":114,"cut":false,"hidden":false,"merged":[[42,7,42,10]]}
["Analysis Price Entered As:",null,null,null,null,null,null,null,null,null,null,null,null,null,null,null,null,null,"Calculation Section"]
[null,null,"80",null,null,null,null,null,null,null,null,null,null,null,null,null,null,null,"Estimated Gross",null,{"$f":"C7","v":478000},{"$f":"C7/(C7-C8)*E74","v":552162.4242424242}]
[null,null,null,null,null,null,null,null,null,null,null,null,null,null,null,null,null,null,"Estimated Operating Costs",null,{"$f":"C8","v":313000},{"$f":"C8/C7*V2","v":361562.4242424242}]
[null,null,null,null,null,null,null,null,null,null,null,null,null,null,null,null,null,"Gross"]
[null,"   ",null,null,null,null,null,null,null,null,null,null,null,null,null,null,null,null,-0.25,null,{"$f":"IF($C$98>0,($S5)*U$2+C$98,\"\")","v":-77750},{"$f":"IF($E$98>0,($S5)*V$2+E$98,\"\")","v":-124290.08036601648}]
["Pre-Investment: Cash Flows & Profitability",null,"Values prior to RE Investment",null,"Subtotals",null,null,null,null,null,null,null,null,null,null,null,null,null,{"$f":"S5+0.025","v":-0.22500000000000001},null,{"$f":"IF($C$98>0,($S6)*U$2+C$98,\"\")","v":-65800},{"$f":"IF($E$98>0,($S6)*V$2+E$98,\"\")","v":-110486.01975995587}]
[null,"Gross Revenue",478000,null,null,null,null,null,null,null,null,null,null,null,null,null,null,null,{"$f":"S6+0.025","v":-0.2},null,-53850,-96681.959153895266]
[null,"Operating Expenses ",313000,null,null,null,null,null,null,null,null,null,null,null,null,null,null,null,-0.17500000000000002,null,-41900.000000000015,-82877.898547834659]
{"$rows_left_out":107}
{"sheet":"Sensitivity Tables","index":4,"n_rows":97,"n_cols":22,"rows_kept":97,"cut":false,"hidden":false,"merged":[[18,1,18,2],[49,6,49,7],[19,1,19,2],[43,6,43,7],[47,6,47,7],[48,6,48,7],[39,7,39,10],[56,6,56,7],[45,7,45,10],[1,1,1,2],[32,6,32,7],[37,6,37,7],[29,7,29,10],[30,6,30,7],[41,6,41,7],[20,1,20,2],[23,7,23,10],[55,6,55,7],[51,8,51,10],[52,8,52,10],[54,6,54,7],[8,6,8,10],[40,6,40,7],[42,6,42,7],[22,5,22,10],[2,5,2,7],[14,5,14,10],[46,6,46,7],[15,6,15,10],[7,5,7,10],[31,6,31,7]]}
[null,null,null,null,null,"              Land Purchase Analysis: Sensitivity Tables",null,null,null,null,null,null,null,null,null,null,null,null,null,null,null,0]
[null,"Farmland Bid Price Estimator"]
[null,null,null,null,null,"Maximum Bid Prices:"]
[null,null,null,null,null,"5 Year Horizon",null,{"$f":"IF('5 Year Model'!O24<0,\"NA\",'5 Year Model'!O24)","v":6929.9}]
[null,{"$f":"'Cash Budgets'!A33","v":"Net Cash Flow: year 1"},{"$f":"CashFlows","v":350},null,null,"10 Year Horizon",null,{"$f":"IF('10 Year Model'!O28<0,\"NA\",'10 Year Model'!O28)","v":8091.02}]
[null,"Annual growth rate of net cash flows",{"$f":"CashFlowGr","v":0.02},null,null,"30 Year Horizon",null,{"$f":"IF('30 Year Model'!O48>0,'30 Year Model'!O48,\"NA\")","v":9622.2099999999991}]
[null,"Annual growth rate of land values",{"$f":"LandGr","v":0.02}]
[null,"Marginal income tax rate",{"$f":"MTR","v":0.28000000000000003},null,null,"Bid Prices at Alternative After-tax Investment Returns"]
{"$rows_left_out":90}
{"sheet":"Cash Budgets","index":5,"n_rows":33,"n_cols":5,"rows_kept":33,"cut":false,"hidden":false,"merged":[[1,1,1,4]]}
[]
[null,"Cash Budget for Investment"]
["Net Cash Flow Calculations","Enterprise 1","Enterprise 2","Enterprise 3","Total"]
[]
["% Total Investment",0,0,0,{"$f":"SUM(B5:D5)","v":0}]
["Market price per unit ",0,0,0]
["Average production units (bu./acre)",0,0,0]
["Other income/cash rent received",0,0,0]
{"$rows_left_out":26}
{"sheet":"Cash Flows","index":6,"n_rows":46,"n_cols":34,"rows_kept":46,"cut":false,"hidden":true,"merged":[[2,28,2,29],[3,28,3,29],[1,25,1,33],[5,25,5,26],[4,25,4,26],[3,25,3,26],[3,31,3,32]]}
[]
[null,null,null,null,"Number of Acres",1,null,null,null,null,null,null,null,null,null,null,null,null,null,null,null,null,null,{"$f":"IF(X3=V3,1,IF(V4=X3,2,3))","v":2},null,{"$f":"IF(year=1,'5 Year Model'!AA1:AI1,IF(year=2,'10 Year Model'!AA1:AI1,'30 Year Model'!AA1:AI1))","v":{"$error":"#VALUE!"}}]
[null,null,null,null,null,null,null,null,null,null,null,null,null,null,null,null,null,null,null,null,null,"5 Year Model",null,"10 Year Model",null,"Model ",null,null,"Max Bid Price"]
[null,null,null,null,"Analysis Price",{"$f":"analysis","v":8000},null,null,null,null,null,null,null,null,null,null,null,null,null,null,null,"10 Year Model",null,null,null,"Analysis Price/Acre",null,null,{"$f":"IF(year=1,'Sensitivity Tables'!A95,IF(year=2,'Sensitivity Tables'!A96,'Sensitivity Tables'!A97))","v":8000},null,null,{"$f":"IF(year=1,'5 Year Model'!AG2:AO2,IF(year=2,'10 Year Model'!AG2:AO2,'30 Year Model'!AG2:AO2))","v":{"$error":"#VALUE!"}},null,{"$f":"IF(year=1,'5 Year Model'!AI2:AQ2,IF(year=2,'10 Year Model'!AI2:AQ2,'30 Year Model'!AI2:AQ2))","v":{"$error":"#VALUE!"}}]
[null,null,null,null,null,null,null,null,null,null,null,null,null,null,null,null,null,null,null,null,null,"30 Year Model",null,null,null,"Acres",null,null,null,null,null,{"$f":"IF(year=1,'5 Year Model'!AG3:AO3,IF(year=2,'10 Year Model'!AG3:AO3,'30 Year Model'!AG3:AO3))","v":{"$error":"#VALUE!"}},{"$f":"IF(year=1,'5 Year Model'!AH3:AP3,IF(year=2,'10 Year Model'!AH3:AP3,'30 Year Model'!AH3:AP3))","v":{"$error":"#VALUE!"}},{"$f":"IF(year=1,'5 Year Model'!AI3:AQ3,IF(year=2,'10 Year Model'!AI3:AQ3,'30 Year Model'!AI3:AQ3))","v":{"$error":"#VALUE!"}}]
[null,null,null,null,null,null,null,null,null,null,null,null,null,null,null,null,null,null,null,null,null,null,null,null,null,"Total Purchase",null,{"$f":"IF(year=1,'5 Year Model'!AC4:AK4,IF(year=2,'10 Year Model'!AC4:AK4,'30 Year Model'!AC4:AK4))","v":{"$error":"#VALUE!"}},null,null,null,{"$f":"IF(year=1,'5 Year Model'!AG4:AO4,IF(year=2,'10 Year Model'!AG4:AO4,'30 Year Model'!AG4:AO4))","v":{"$error":"#VALUE!"}}]
[null,null,null,null,null,null,null,null,null,null,null,null,null,null,null,null,null,null,null,null,null,null,null,null,null,null,{"$f":"IF(year=1,'5 Year Model'!AB5:AJ5,IF(year=2,'10 Year Model'!AB5:AJ5,'30 Year Model'!AB5:AJ5))","v":{"$error":"#VALUE!"}},{"$f":"IF(year=1,'5 Year Model'!AC5:AK5,IF(year=2,'10 Year Model'!AC5:AK5,'30 Year Model'!AC5:AK5))","v":{"$error":"#VALUE!"}},{"$f":"IF(year=1,'5 Year Model'!AD5:AL5,IF(year=2,'10 Year Model'!AD5:AL5,'30 Year Model'!AD5:AL5))","v":{"$error":"#VALUE!"}},{"$f":"IF(year=1,'5 Year Model'!AE5:AM5,IF(year=2,'10 Year Model'!AE5:AM5,'30 Year Model'!AE5:AM5))","v":{"$error":"#VALUE!"}},{"$f":"IF(year=1,'5 Year Model'!AF5:AN5,IF(year=2,'10 Year Model'!AF5:AN5,'30 Year Model'!AF5:AN5))","v":{"$error":"#VALUE!"}},{"$f":"IF(year=1,'5 Year Model'!AG5:AO5,IF(year=2,'10 Year Model'!AG5:AO5,'30 Year Model'!AG5:AO5))","v":{"$error":"#VALUE!"}},{"$f":"IF(year=1,'5 Year Model'!AH5:AP5,IF(year=2,'10 Year Model'!AH5:AP5,'30 Year Model'!AH5:AP5))","v":{"$error":"#VALUE!"}},{"$f":"IF(year=1,'5 Year Model'!AI5:AQ5,IF(year=2,'10 Year Model'!AI5:AQ5,'30 Year Model'!AI5:AQ5))","v":{"$error":"#VALUE!"}}]
[null,null,null,null,null,null,null,null,null,null,null,null,null,null,null,null,null,null,null,null,null,null,null,null,null,{"$f":"IF(year=1,'5 Year Model'!AA6:AI6,IF(year=2,'10 Year Model'!AA6:AI6,'30 Year Model'!AA6:AI6))","v":{"$error":"#VALUE!"}},{"$f":"IF(year=1,'5 Year Model'!AB6:AJ6,IF(year=2,'10 Year Model'!AB6:AJ6,'30 Year Model'!AB6:AJ6))","v":{"$error":"#VALUE!"}},{"$f":"IF(year=1,'5 Year Model'!AC6:AK6,IF(year=2,'10 Year Model'!AC6:AK6,'30 Year Model'!AC6:AK6))","v":{"$error":"#VALUE!"}},{"$f":"IF(year=1,'5 Year Model'!AD6:AL6,IF(year=2,'10 Year Model'!AD6:AL6,'30 Year Model'!AD6:AL6))","v":{"$error":"#VALUE!"}},{"$f":"IF(year=1,'5 Year Model'!AE6:AM6,IF(year=2,'10 Year Model'!AE6:AM6,'30 Year Model'!AE6:AM6))","v":{"$error":"#VALUE!"}},{"$f":"IF(year=1,'5 Year Model'!AF6:AN6,IF(year=2,'10 Year Model'!AF6:AN6,'30 Year Model'!AF6:AN6))","v":{"$error":"#VALUE!"}},{"$f":"IF(year=1,'5 Year Model'!AG6:AO6,IF(year=2,'10 Year Model'!AG6:AO6,'30 Year Model'!AG6:AO6))","v":{"$error":"#VALUE!"}},{"$f":"IF(year=1,'5 Year Model'!AH6:AP6,IF(year=2,'10 Year Model'!AH6:AP6,'30 Year Model'!AH6:AP6))","v":{"$error":"#VALUE!"}},{"$f":"IF(year=1,'5 Year Model'!AI6:AQ6,IF(year=2,'10 Year Model'!AI6:AQ6,'30 Year Model'!AI6:AQ6))","v":{"$error":"#VALUE!"}}]
{"$rows_left_out":39}
{"sheet":"5 Year Model","index":7,"n_rows":52,"n_cols":35,"rows_kept":52,"cut":false,"hidden":false,"merged":[[0,26,0,34]]}
[null,null,null,null,null,null,null,null,null,null,null,null,null,null,null,null,null,null,null,null,null,null,null,null,null,null,"Cash Flow for Equivalent  Investments 5 Year Model"]
[null,null,null,null,null,null,null,null,null,null,null,null,null,null,null,null,null,null,null,null,null,null,null,null,null,null,null,"Analysis Price/Acre",{"$f":"price5","v":8000},null,null,null,"Certificate of Deposit",null,{"$f":"AC4","v":8000}]
["    ",null,{"$f":"'Sensitivity Tables'!$B$34","v":1},null,"   5 year horizon",null,null,null,null,null,null,null,null,null,null,null,null,null,null,null,null,null,null,null,null,null,null,"Acres",20,null,null,null,"Interest Rate",null,{"$f":"O14/(1-IncomeTax)","v":3.5420680374754272E-2}]
[null,null,null,null,null,null,null,null,null,null,null,null,null,null,null,null,"Analysis Price",null,null,null,null,null,null,null,null,null,null,"Total Purchase",{"$f":"price5","v":8000},null,null,null,"After Tax Cash Flows Reinvested Annually"]
[null,null,null,null,"Property Taxes",null,null,null,"Downpayment &",null,null,null,null,"Analysis Price:",{"$f":"analysis","v":8000},null,{"$f":"analysis","v":8000},null,null,null,null,null,null,null,null,null,null,"Net Cash Flows",null,"Income","After Tax",null,null,"Income","End-of-Year"]
[null,null,null,"Net","and Amortized","Debt","Debt","Interest ","Principal",null,"After Tax","Capital ",null,"Ending","Net After ",null,"Net Present",null,null,null,null,null,null,null,null,null,"Year","Including RE Taxes","Debt Payments","Taxes","Cash Flows",null,"Interest Income","Taxes","Value"]
[null,null,"Year","Cash Flows","Closing Costs","Payments","Outstanding","Payments","Payments","Depreciation","Cash Flows","Gains Tax","Land Value","Debt Value","Tax Cash Flows",null,"Value Calc.",null,null,{"$f":"solve5","v":-164.59},null,null,null,null,null,null,null,null,null,null,null,null,null,null,"After Taxes"]
[null,"Initial Investment",0,null,null,null,null,null,{"$f":"O5*(1-financed)","v":2000},null,null,null,null,null,{"$f":"-(price5*closing)-I8","v":-2080},null,-2080,null,{"$f":"Q5","v":8000},-164.59,null,null,null,null,null,null,{"$f":"C8","v":0},{"$f":"price5*closing","v":80},{"$f":"#REF!","v":{"$error":"#REF!"}},null,{"$f":"price5*closing","v":80},null,null,null,{"$f":"AI2","v":8000}]
{"$rows_left_out":45}
{"sheet":"10 Year Model","index":8,"n_rows":52,"n_cols":35,"rows_kept":52,"cut":false,"hidden":false,"merged":[[0,26,0,34]]}
[null,null,null,null,null,null,null,null,null,null,null,null,null,null,null,null,null,null,null,null,null,null,null,null,null,null,"Cash Flow for Equivalent  Investments 10 Year Model"]
[null,null,null,null,null,null,null,null,null,null,null,null,null,null,null,null,null,null,null,null,null,null,null,null,null,null,null,"Analysis Price/Acre",{"$f":"AC4/AC3","v":8000},null,null,null,"Certificate of Deposit",null,{"$f":"AC4","v":8000}]
[null,null,{"$f":"'Sensitivity Tables'!$B$34","v":1},null,"    10 year horizon",null,null,null,null,null,null,null,null,null,null,null,null,null,null,null,null,null,null,null,null,null,null,"Acres",{"$f":"acres","v":1},null,null,null,"Interest Rate",null,{"$f":"O19/(1-IncomeTax)","v":5.6729303894159339E-2}]
[null,null,null,null,null,null,null,null,null,null,null,null,null,null,null,null,"Analysis Price",null,null,null,null,null,null,null,null,null,null,"Total Purchase",{"$f":"price10","v":8000},null,null,null,"After Tax Cash Flows Reinvested Annually"]
[null,null,null,null,"Property Taxes",null,null,null,"Downpayment &",null,null,null,null,"Analysis Price:",{"$f":"analysis","v":8000},null,{"$f":"'Sensitivity Tables'!C18","v":8000},null,null,null,null,null,null,null,null,null,null,"Net Cash Flows",null,"Income","After Tax",null,null,"Income","End-of-Year"]
[null,1,null,"Net","and Amortized","Debt","Debt","Interest ","Principal",null,"After Tax","Capital ",null,"Ending","Net After Tax",null,"Net Present",null,null,null,null,null,null,null,null,null,"Year","Including RE Taxes","Debt Payments","Taxes","Cash Flows",null,"Interest Income","Taxes","Value"]
[null,null,"Year","Cash Flows","Closing Costs","Payments","Outstanding","Payments","Payments","Depreciation","Cash Flows","Gains Tax","Land Value","Debt Value","Cash Flows",null,"Value Calc.",null,null,null,null,null,null,null,null,null,null,"& Loan Fees",null,null,null,null,null,null,"After Taxes"]
[null,"Initial Investment",0,null,null,null,null,null,{"$f":"O5*(1-financed)","v":2000},null,{"$f":"-I8","v":-2000},null,null,null,{"$f":"-(price10*closing)-I8","v":-2080},null,-2080,null,null,null,null,null,null,null,null,null,{"$f":"C8","v":0},{"$f":"price10*closing","v":80},{"$f":"F8","v":0},null,{"$f":"price10*closing","v":80},null,null,null,{"$f":"AI2","v":8000}]
{"$rows_left_out":45}
{"sheet":"30 Year Model","index":9,"n_rows":65,"n_cols":35,"rows_kept":65,"cut":false,"hidden":false,"merged":[[0,26,0,34]]}
[null,null,null,null,null,null,null,null,null,null,null,null,null,null,null,null,null,null,null,null,null,null,null,null,null,null,"Cash Flow for Equivalent  Investments 30 Year Model"]
[null,null,null,null,null,null,null,null,null,null,null,null,null,null,null,null,null,null,null,null,null,null,null,null,null,null,null,"Analysis Price/Acre",{"$f":"AC4/AC3","v":8000},null,null,null,"Certificate of Deposit",null,{"$f":"AC4","v":8000}]
[null,null,{"$f":"'Sensitivity Tables'!$B$34","v":1},null,"  30 year horizon",null,null,null,null,null,null,null,null,null,null,null,null,null,null,null,null,null,null,null,null,null,null,"Acres",{"$f":"acres","v":1},null,null,null,"Interest Rate",null,{"$f":"O39/(1-IncomeTax)","v":6.6002326712034473E-2}]
[null,null,null,null,null,null,null,null,null,null,null,null,null,null,null,null,"Analysis Price",null,null,null,null,null,null,null,null,null,null,"Total Purchase",{"$f":"price30","v":8000},null,null,null,"After Tax Cash Flows Reinvested Annually"]
[null,null,null,null,"Property Taxes",null,null,null,"Downpayment &",null,null,null,null,"Analysis Price",{"$f":"analysis","v":8000},null,{"$f":"analysis","v":8000},null,null,null,null,null,null,null,null,null,null,"Net Cash Flows",null,"Income","After Tax",null,null,"Income","End-of-Year"]
[null,null,null,"Net","and Amortized","Debt","Debt","Interest ","Principal",null,"After Tax","Capital ",null,"Ending","Net After ",null,"Net Present",null,null,null,null,null,null,null,null,null,"Year","Including RE Taxes","Debt Payments","Taxes","Cash Flows",null,"Interest Income","Taxes","Value"]
[null,null,"Year","Cash Flows","Closing Costs","Payments","Outstanding","Payments","Payments","Depreciation","Cash Flows","Gains Tax","Land Value","Debt Value","Tax Cash Flows",null,"Value Calc.",null,null,null,null,null,null,null,null,null,null,"& Loan Fees",null,null,null,null,null,null,"After Taxes"]
[null,"Initial Investment",0,null,null,null,null,null,{"$f":"O5*(1-financed)","v":2000},null,{"$f":"-I8","v":-2000},null,null,null,{"$f":"-(price30*closing)-I8","v":-2080},null,-2080,null,null,null,null,null,null,null,null,null,{"$f":"C8","v":0},{"$f":"price30*closing","v":80},{"$f":"F8","v":0},null,{"$f":"price30*closing","v":80},null,null,null,{"$f":"AI2","v":8000}]
{"$rows_left_out":57}