{"text_format":"1","workbook":"xlsx","n_sheets":5,"sheets":["Ag Balance Sheet Graphical","US AG B-S Background Data","Sample Graphs","Balance Sheet Table ","graphhelp - BJS"],"not_rendered":{"charts":6,"images":3,"macros":0,"external_links":0,"defined_names":48,"comments":0,"pivot_tables":0},"unopened":[],"bounds":{"document_bytes":16777216,"sheet_cells":100000,"rows_first":2000,"rows_last":500,"rows_between":2000,"halvings":0,"cell_chars":16384,"cell_head_chars":4096},"cells_cut":0,"cells_raw":0,"read":"whole","date_system":"1900"}

{"sheet":"Ag Balance Sheet Graphical","index":0,"n_rows":15,"n_cols":56,"rows_kept":15,"cut":false,"hidden":true,"merged":[]}
[]
[]
[]
[]
[]
[]
[]
[]
[]
[]
[]
[null,"Select Series to Graph",{"$f":"--C14","v":1960},{"$f":"--D14","v":1961},1962,1963,1964,1965,1966,1967,1968,1969,1970,1971,1972,1973,1974,1975,1976,1977,1978,1979,1980,1981,1982,1983,1984,1985,1986,1987,1988,1989,1990,1991,1992,1993,1994,1995,1996,1997,1998,1999,2000,2001,2002,2003,2004,2005,2006,2007,2008,2009,2010,2011,2012,2013]
[null,"Number of Farms                                                                                                                              ",2,3,4,5,6,7,8,9,10,11,12,13,14,15,16,17,18,19,20,21,22,23,24,25,26,27,28,29,30,31,32,33,34,35,36,37,38,39,40,41,42,43,44,45,46,47,48,49,50,51,52,53,54,54]
[null,"Year",1960,1961,1962,1963,1964,1965,1966,1967,1968,1969,1970,1971,1972,1973,1974,1975,1976,1977,1978,1979,1980,1981,1982,1983,1984,1985,1986,1987,1988,1989,1990,1991,1992,1993,1994,1995,1996,1997,1998,1999,2000,2001,2002,2003,2004,2005,2006,2007,2008,2009,2010,2011,2012,2013]
[null,{"$f":"B13","v":"Number of Farms                                                                                                                              "},{"$f":"IFERROR(--VLOOKUP($B$13,'US AG B-S Background Data'!$C$11:$BE$48,C13,0),\"\")","v":3962520},{"$f":"IFERROR(--VLOOKUP($B$13,'US AG B-S Background Data'!$C$11:$BE$48,D13,0),\"\")","v":3825410},{"$f":"IFERROR(--VLOOKUP($B$13,'US AG B-S Background Data'!$C$11:$BE$48,E13,0),\"\")","v":3692410},{"$f":"IFERROR(--VLOOKUP($B$13,'US AG B-S Background Data'!$C$11:$BE$48,F13,0),\"\")","v":3572200},{"$f":"IFERROR(--VLOOKUP($B$13,'US AG B-S Background Data'!$C$11:$BE$48,G13,0),\"\")","v":3456690},{"$f":"IFERROR(--VLOOKUP($B$13,'US AG B-S Background Data'!$C$11:$BE$48,H13,0),\"\")","v":3356170},{"$f":"IFERROR(--VLOOKUP($B$13,'US AG B-S Background Data'!$C$11:$BE$48,I13,0),\"\")","v":3257040},{"$f":"IFERROR(--VLOOKUP($B$13,'US AG B-S Background Data'!$C$11:$BE$48,J13,0),\"\")","v":3161730},{"$f":"IFERROR(--VLOOKUP($B$13,'US AG B-S Background Data'!$C$11:$BE$48,K13,0),\"\")","v":3070860},{"$f":"IFERROR(--VLOOKUP($B$13,'US AG B-S Background Data'!$C$11:$BE$48,L13,0),\"\")","v":3000180},{"$f":"IFERROR(--VLOOKUP($B$13,'US AG B-S Background Data'!$C$11:$BE$48,M13,0),\"\")","v":2949140},{"$f":"IFERROR(--VLOOKUP($B$13,'US AG B-S Background Data'!$C$11:$BE$48,N13,0),\"\")","v":2902310},{"$f":"IFERROR(--VLOOKUP($B$13,'US AG B-S Background Data'!$C$11:$BE$48,O13,0),\"\")","v":2859880},{"$f":"IFERROR(--VLOOKUP($B$13,'US AG B-S Background Data'!$C$11:$BE$48,P13,0),\"\")","v":2823260},{"$f":"IFERROR(--VLOOKUP($B$13,'US AG B-S Background Data'!$C$11:$BE$48,Q13,0),\"\")","v":2795460},{"$f":"IFERROR(--VLOOKUP($B$13,'US AG B-S Background Data'!$C$11:$BE$48,R13,0),\"\")","v":2521420},{"$f":"IFERROR(--VLOOKUP($B$13,'US AG B-S Background Data'!$C$11:$BE$48,S13,0),\"\")","v":2497270},{"$f":"IFERROR(--VLOOKUP($B$13,'US AG B-S Background Data'!$C$11:$BE$48,T13,0),\"\")","v":2455830},{"$f":"IFERROR(--VLOOKUP($B$13,'US AG B-S Background Data'!$C$11:$BE$48,U13,0),\"\")","v":2436250},{"$f":"IFERROR(--VLOOKUP($B$13,'US AG B-S Background Data'!$C$11:$BE$48,V13,0),\"\")","v":2437300},{"$f":"IFERROR(--VLOOKUP($B$13,'US AG B-S Background Data'!$C$11:$BE$48,W13,0),\"\")","v":2439510},{"$f":"IFERROR(--VLOOKUP($B$13,'US AG B-S Background Data'!$C$11:$BE$48,X13,0),\"\")","v":2439920},{"$f":"IFERROR(--VLOOKUP($B$13,'US AG B-S Background Data'!$C$11:$BE$48,Y13,0),\"\")","v":2406550},{"$f":"IFERROR(--VLOOKUP($B$13,'US AG B-S Background Data'!$C$11:$BE$48,Z13,0),\"\")","v":2378620},{"$f":"IFERROR(--VLOOKUP($B$13,'US AG B-S Background Data'!$C$11:$BE$48,AA13,0),\"\")","v":2333810},{"$f":"IFERROR(--VLOOKUP($B$13,'US AG B-S Background Data'!$C$11:$BE$48,AB13,0),\"\")","v":2292530},{"$f":"IFERROR(--VLOOKUP($B$13,'US AG B-S Background Data'!$C$11:$BE$48,AC13,0),\"\")","v":2249820},{"$f":"IFERROR(--VLOOKUP($B$13,'US AG B-S Background Data'!$C$11:$BE$48,AD13,0),\"\")","v":2212960},{"$f":"IFERROR(--VLOOKUP($B$13,'US AG B-S Background Data'!$C$11:$BE$48,AE13,0),\"\")","v":2200940},{"$f":"IFERROR(--VLOOKUP($B$13,'US AG B-S Background Data'!$C$11:$BE$48,AF13,0),\"\")","v":2174520},{"$f":"IFERROR(--VLOOKUP($B$13,'US AG B-S Background Data'!$C$11:$BE$48,AG13,0),\"\")","v":2145820},{"$f":"IFERROR(--VLOOKUP($B$13,'US AG B-S Background Data'!$C$11:$BE$48,AH13,0),\"\")","v":2116760},{"$f":"IFERROR(--VLOOKUP($B$13,'US AG B-S Background Data'!$C$11:$BE$48,AI13,0),\"\")","v":2107840},{"$f":"IFERROR(--VLOOKUP($B$13,'US AG B-S Background Data'!$C$11:$BE$48,AJ13,0),\"\")","v":2201590},{"$f":"IFERROR(--VLOOKUP($B$13,'US AG B-S Background Data'!$C$11:$BE$48,AK13,0),\"\")","v":2197690},{"$f":"IFERROR(--VLOOKUP($B$13,'US AG B-S Background Data'!$C$11:$BE$48,AL13,0),\"\")","v":2196400},{"$f":"IFERROR(--VLOOKUP($B$13,'US AG B-S Background Data'!$C$11:$BE$48,AM13,0),\"\")","v":2190500},{"$f":"IFERROR(--VLOOKUP($B$13,'US AG B-S Background Data'!$C$11:$BE$48,AN13,0),\"\")","v":2190510},{"$f":"IFERROR(--VLOOKUP($B$13,'US AG B-S Background Data'!$C$11:$BE$48,AO13,0),\"\")","v":2192330},{"$f":"IFERROR(--VLOOKUP($B$13,'US AG B-S Background Data'!$C$11:$BE$48,AP13,0),\"\")","v":2187280},{"$f":"IFERROR(--VLOOKUP($B$13,'US AG B-S Background Data'!$C$11:$BE$48,AQ13,0),\"\")","v":2166780},{"$f":"IFERROR(--VLOOKUP($B$13,'US AG B-S Background Data'!$C$11:$BE$48,AR13,0),\"\")","v":2148630},{"$f":"IFERROR(--VLOOKUP($B$13,'US AG B-S Background Data'!$C$11:$BE$48,AS13,0),\"\")","v":2135360},{"$f":"IFERROR(--VLOOKUP($B$13,'US AG B-S Background Data'!$C$11:$BE$48,AT13,0),\"\")","v":2126860},{"$f":"IFERROR(--VLOOKUP($B$13,'US AG B-S Background Data'!$C$11:$BE$48,AU13,0),\"\")","v":2112970},{"$f":"IFERROR(--VLOOKUP($B$13,'US AG B-S Background Data'!$C$11:$BE$48,AV13,0),\"\")","v":2098690},{"$f":"IFERROR(--VLOOKUP($B$13,'US AG B-S Background Data'!$C$11:$BE$48,AW13,0),\"\")","v":2088790},{"$f":"IFERROR(--VLOOKUP($B$13,'US AG B-S Background Data'!$C$11:$BE$48,AX13,0),\"\")","v":2204600},{"$f":"IFERROR(--VLOOKUP($B$13,'US AG B-S Background Data'!$C$11:$BE$48,AY13,0),\"\")","v":2184500},{"$f":"IFERROR(--VLOOKUP($B$13,'US AG B-S Background Data'!$C$11:$BE$48,AZ13,0),\"\")","v":2169660},{"$f":"IFERROR(--VLOOKUP($B$13,'US AG B-S Background Data'!$C$11:$BE$48,BA13,0),\"\")","v":2149520},{"$f":"IFERROR(--VLOOKUP($B$13,'US AG B-S Background Data'!$C$11:$BE$48,BB13,0),\"\")","v":2131240},{"$f":"IFERROR(--VLOOKUP($B$13,'US AG B-S Background Data'!$C$11:$BE$48,BC13,0),\"\")","v":2109810},{"$f":"IFERROR(--VLOOKUP($B$13,'US AG B-S Background Data'!$C$11:$BE$48,BD13,0),\"\")","v":2109810}]
{"$rows_left_out":1}
{"sheet":"US AG B-S Background Data","index":1,"n_rows":111,"n_cols":67,"rows_kept":111,"cut":false,"hidden":false,"merged":[]}
[]
[]
[null,null,"Table 1--Farm business balance sheet, 1960-2023f                                            "]
[null,null,"                                                                                                                                   "]
[null,null,"United States                                                                                                                      "]
[null,null,"                                                                                                                                   "]
[null,null,"Year ","1960","1961","1962","1963","1964","1965","1966","1967","1968","1969",1970,"1971","1972","1973","1974","1975","1976","1977","1978","1979","1980","1981","1982","1983","1984","1985","1986","1987","1988","1989","1990","1991","1992","1993","1994","1995","1996","1997","1998","1999","2000","2001","2002","2003","2004","2005","2006","2007","2008","2009","2010",2011,2012,2013,2014,2015,2016,2017,2018,2019,2020,2021,2022,2023]
[null,null,"                                                                                                                                   "]
[null,null,null,null,null,null,null,"Numbers",null,null,null,null,null,null,null,null,null,"Numbers",null,null,null,null,null,null,null,null,null,"Numbers",null,null,null,null,null,null,null,null,null,"Numbers"]
[null,null,"                                                                                                                                   "]
[null,null,"Number of Farms                                                                                                                              ",3962520,3825410,3692410,3572200,3456690,3356170,3257040,3161730,3070860,3000180,2949140,2902310,2859880,2823260,2795460,2521420,2497270,2455830,2436250,2437300,2439510,2439920,2406550,2378620,2333810,2292530,2249820,2212960,2200940,2174520,2145820,2116760,2107840,2201590,2197690,2196400,2190500,2190510,2192330,2187280,2166780,2148630,2135360,2126860,2112970,2098690,2088790,2204600,2184500,2169660,2149520,2131240,2109810,2102010,2082440,2063890,2052261,2033724,2020919,2015068,2010664,2003754,"1,988,288(f)","not available"]
[null,null,null,null,null,null,null,"Thousand dollars",null,null,null,null,null,null,null,null,null,"Thousand dollars",null,null,null,null,null,null,null,null,null,"Thousand dollars",null,null,null,null,null,null,null,null,null,"Thousand dollars"]
[null,null,"Farm assets                                                                                                                        ",174350138,181631733,188870449,196695336,204238278,220817624,234022906,246072706,257160621,267822833,278823015,301760581,339933247,418493949,449181770,510786259,590716642,651508183,777744402,914682365,1000422127,997897469,962488416,959300462,897811233,775907905,722017259,756478652,788525662,813731058,840608505,844167552,867762818,909174821,934724297,965741060,1002916227,1051280908,1083354897,1138826915,1203214765,1255926409,1250530486,1322433781,1491953134,1709371086,1906665033,1961943172,2005861900,1976913105,2170832085,2318720178,2638246236,2767754249,2930596397,2880014647,2914440909,3005944863,3026678682,3075148145,3174623195,3497614240,3848184726,4047027328]
[null,null," Real estate                                                                                                                       ",123280105,129097425,134614477,142353253,150485891,161524641,171233350,180942601,189388755,195309483,202418081,217562382,243002153,298300207,335556227,383559733,456539435,509308292,601773349,706063787,782820207,785561830,750023254,753422019,661750215,586183371,542407976,563678551,582311234,600132424,619149240,624769057,640790780,677577858,704137650,740491453,769535891,808228878,840421562,886981055,946427649,996242486,1003708881,1016350076,1161561634,1372626160,1536641152,1548985369,1568551418,1560555911,1660113798,1802702005,2073664481,2251001916,2383150407,2365717294,2401352455,2472843963,2510163458,2545995513,2640942455,2895998249,3188219412,3389550688]
[null,null," Livestock and poultry                                                                                            ",15607597,16428026,17306979,15864578,14469305,17584671,18973530,18845528,20249055,22838634,23705761,27263869,33679316,42370002,24567475,29356695,29047508,31931218,50105786,61386773,60633203,53544275,52993051,49540878,49525922,46259169,47751409,57976580,62211338,66212752,70856057,68119760,70962162,72778679,67912189,57778086,60314851,67075193,63391480,73177382,76787712,78535901,67877550,74506996,83334116,87758593,86698438,89358661,86198460,80267748,90715139,101446630,95743147,110836501,127852850,118183719,108996528,107085709,97131860,99159424,98288022,104112399,132301505,125476823]
{"$rows_left_out":97}
{"sheet":"Sample Graphs","index":2,"n_rows":18,"n_cols":19,"rows_kept":18,"cut":false,"hidden":false,"merged":[]}
[]
[]
[]
[]
[]
[]
[]
[]
[]
[]
[]
[]
[]
[]
[]
{"$rows_left_out":4}
{"sheet":"Balance Sheet Table ","index":3,"n_rows":22,"n_cols":18,"rows_kept":22,"cut":false,"hidden":false,"merged":[]}
[]
[]
[null,"Table 1.  Selected Balance Sheet Characteristics of US Agricultural Sector"]
[]
[null,null,null,{"$f":"'US AG B-S Background Data'!N7","v":1970},{"$f":"'US AG B-S Background Data'!X7","v":"1980"},{"$f":"'US AG B-S Background Data'!AH7","v":"1990"},{"$f":"'US AG B-S Background Data'!AR7","v":"2000"},{"$f":"'US AG B-S Background Data'!BB7","v":"2010"},2013,2015,2016,2017,2018,2019,2020,2021,2022,"2023(p)"]
[null,null,null,null,null,null,"($ millions, except ratios - source ERS-USDA)"]
[null,"Farm Assets ",null,{"$f":"('US AG B-S Background Data'!N13)/1000","v":278823.01500000001},{"$f":"('US AG B-S Background Data'!X13)/1000","v":1000422.127},{"$f":"('US AG B-S Background Data'!AH13)/1000","v":840608.505},{"$f":"('US AG B-S Background Data'!AR13)/1000","v":1203214.7649999999},{"$f":"('US AG B-S Background Data'!BB13)/1000","v":2170832.085},{"$f":"('US AG B-S Background Data'!BE13)/1000","v":2767754.2489999998},{"$f":"('US AG B-S Background Data'!BG13)/1000","v":2880014.6469999999},{"$f":"('US AG B-S Background Data'!BH13)/1000","v":2914440.909},{"$f":"('US AG B-S Background Data'!BI13)/1000","v":3005944.8629999999},{"$f":"('US AG B-S Background Data'!BJ13)/1000","v":3026678.682},{"$f":"('US AG B-S Background Data'!BK13)/1000","v":3075148.145},{"$f":"('US AG B-S Background Data'!BL13)/1000","v":3174623.1949999998},{"$f":"('US AG B-S Background Data'!BM13)/1000","v":3497614.24},{"$f":"('US AG B-S Background Data'!BN13)/1000","v":3848184.7259999998},{"$f":"('US AG B-S Background Data'!BO13)/1000","v":4047027.3280000002}]
[null,"Real Estate",null,{"$f":"('US AG B-S Background Data'!N14)/1000","v":202418.08100000001},{"$f":"('US AG B-S Background Data'!X14)/1000","v":782820.20700000005},{"$f":"('US AG B-S Background Data'!AH14)/1000","v":619149.24},{"$f":"('US AG B-S Background Data'!AR14)/1000","v":946427.64899999998},{"$f":"('US AG B-S Background Data'!BB14)/1000","v":1660113.798},{"$f":"('US AG B-S Background Data'!BE14)/1000","v":2251001.9160000002},{"$f":"('US AG B-S Background Data'!BG14)/1000","v":2365717.2940000002},{"$f":"('US AG B-S Background Data'!BH14)/1000","v":2401352.4550000001},{"$f":"('US AG B-S Background Data'!BI14)/1000","v":2472843.963},{"$f":"('US AG B-S Background Data'!BJ14)/1000","v":2510163.4580000001},{"$f":"('US AG B-S Background Data'!BK14)/1000","v":2545995.5129999998},{"$f":"('US AG B-S Background Data'!BL14)/1000","v":2640942.4550000001},{"$f":"('US AG B-S Background Data'!BM14)/1000","v":2895998.2489999998},{"$f":"('US AG B-S Background Data'!BN14)/1000","v":3188219.412},{"$f":"('US AG B-S Background Data'!BO14)/1000","v":3389550.6880000001}]
[null,"Non Real Estate",null,{"$f":"D7-D8","v":76404.934000000008},{"$f":"E7-E8","v":217601.91999999993},221459.26500000001,{"$f":"G7-G8","v":256787.11599999992},{"$f":"H7-H8","v":510718.28700000001},{"$f":"I7-I8","v":516752.33299999963},{"$f":"J7-J8","v":514297.35299999965},513088.45399999991,533100.89999999991,516515.22399999993,529152.63200000022,533680.73999999976,601615.99100000039,659965.31399999978,657476.64000000013]
[]
[null,"Farm Debt",null,{"$f":"('US AG B-S Background Data'!N22)/1000","v":48501.006999999998},{"$f":"('US AG B-S Background Data'!X22)/1000","v":162431.96799999999},{"$f":"('US AG B-S Background Data'!AH22)/1000","v":131115.79500000001},{"$f":"('US AG B-S Background Data'!AR22)/1000","v":163929.823},{"$f":"('US AG B-S Background Data'!BB22)/1000","v":278930.53399999999},{"$f":"('US AG B-S Background Data'!BE22)/1000","v":315332.48800000001},{"$f":"('US AG B-S Background Data'!BG22)/1000","v":356738.04100000003},{"$f":"('US AG B-S Background Data'!BH22)/1000","v":374164.212},{"$f":"('US AG B-S Background Data'!BI22)/1000","v":390425.223},{"$f":"('US AG B-S Background Data'!BJ22)/1000","v":402605.50400000002},{"$f":"('US AG B-S Background Data'!BK22)/1000","v":420494.8},{"$f":"('US AG B-S Background Data'!BL22)/1000","v":441253.79300000001},{"$f":"('US AG B-S Background Data'!BM22)/1000","v":474115.80099999998},{"$f":"('US AG B-S Background Data'!BN22)/1000","v":503894.66600000003},{"$f":"('US AG B-S Background Data'!BO22)/1000","v":535085.78500000003}]
[null,"Real Estate",null,{"$f":"('US AG B-S Background Data'!N23)/1000","v":27238.348000000002},{"$f":"('US AG B-S Background Data'!X23)/1000","v":85272.366999999998},{"$f":"('US AG B-S Background Data'!AH23)/1000","v":67632.972999999998},{"$f":"('US AG B-S Background Data'!AR23)/1000","v":84723.763000000006},{"$f":"('US AG B-S Background Data'!BB23)/1000","v":154065.22500000001},{"$f":"('US AG B-S Background Data'!BE23)/1000","v":185160.53},{"$f":"('US AG B-S Background Data'!BG23)/1000","v":208769.24600000001},{"$f":"('US AG B-S Background Data'!BH23)/1000","v":225980.43299999999},{"$f":"('US AG B-S Background Data'!BI23)/1000","v":236243.057},{"$f":"('US AG B-S Background Data'!BJ23)/1000","v":245773.538},{"$f":"('US AG B-S Background Data'!BK23)/1000","v":267943.65500000003},{"$f":"('US AG B-S Background Data'!BL23)/1000","v":288645.32500000001},{"$f":"('US AG B-S Background Data'!BM23)/1000","v":324257.29800000001},{"$f":"('US AG B-S Background Data'!BN23)/1000","v":349067.86099999998},{"$f":"('US AG B-S Background Data'!BO23)/1000","v":375860.11800000002}]
[null,"Non Real Estate",null,{"$f":"(D11-D12)","v":21262.658999999996},{"$f":"(E11-E12)","v":77159.600999999995},63482.822000000015,79206.06,124865.30899999998,130171.95800000001,{"$f":"(J11-J12)","v":147968.79500000001},148183.77900000001,154182.166,156831.96600000001,152551.14499999996,152608.46799999999,149858.50299999997,154826.80500000005,159225.66700000002]
[]
[null,"Equity",null,{"$f":"(D7-D11)","v":230322.00800000003},{"$f":"(E7-E11)","v":837990.15899999999},709492.71,1039284.9419999999,1891901.551,2452421.7609999999,{"$f":"(J7-J11)","v":2523276.6059999997},2540276.6970000002,2615519.6399999997,2624073.1779999998,2654653.3450000002,2733369.4019999998,3023498.4390000002,3344290.0599999996,3511941.5430000001]
{"$rows_left_out":8}
{"sheet":"graphhelp - BJS","index":4,"n_rows":112,"n_cols":64,"rows_kept":112,"cut":false,"hidden":true,"merged":[]}
[]
[]
[null,null,"Table 1--Farm business balance sheet, 1960-2019f                                            "]
[null,null,"                                                                                                                                   "]
[null,null,"United States                                                                                                                      "]
[null,null,"                                                                                                                                   "]
[null,null,"Year ","1960","1961","1962","1963","1964","1965","1966","1967","1968","1969","1970","1971","1972","1973","1974","1975","1976","1977","1978","1979","1980","1981","1982","1983","1984","1985","1986","1987","1988","1989","1990","1991","1992","1993","1994","1995","1996","1997","1998","1999","2000","2001","2002","2003","2004","2005","2006","2007","2008","2009","2010",2011,2012,2013,2014,2015,2016,2017,2018,2019]
[null,null,"                                                                                                                                   "]
[null,null,null,null,null,null,null,"Numbers",null,null,null,null,null,null,null,null,null,"Numbers",null,null,null,null,null,null,null,null,null,"Numbers",null,null,null,null,null,null,null,null,null,"Numbers"]
[null,null,"                                                                                                                                   "]
[null,null,"Number of Farms                                                                                                                              ",3962520,3825410,3692410,3572200,3456690,3356170,3257040,3161730,3070860,3000180,2949140,2902310,2859880,2823260,2795460,2521420,2497270,2455830,2436250,2437300,2439510,2439920,2406550,2378620,2333810,2292530,2249820,2212960,2200940,2174520,2145820,2116760,2107840,2201590,2197690,2196400,2190500,2190510,2192330,2187280,2166780,2148630,2135360,2126860,2112970,2098690,2088790,2204600,2184500,2169660,2149520,2131240,2109810,2102010,2082440,2063890,2055340,2042000,2029200,"(not available)"]
[null,null,null,null,null,null,null,"Thousand dollars",null,null,null,null,null,null,null,null,null,"Thousand dollars",null,null,null,null,null,null,null,null,null,"Thousand dollars",null,null,null,null,null,null,null,null,null,"Thousand dollars"]
[null,null,"Year ",1960,1961,1962,1963,1964,1965,1966,1967,1968,1969,1970,1971,1972,1973,1974,1975,1976,1977,1978,1979,1980,1981,1982,1983,1984,1985,1986,1987,1988,1989,1990,1991,1992,1993,1994,1995,1996,1997,1998,1999,2000,2001,2002,2003,2004,2005,2006,2007,2008,2009,2010,2011,2012,2013,2014,2015,2016,2017,2018,2019,2020]
[null,null,"Farm assets                                                                                                                        ",174350138,181631733,188870449,196695336,204238278,220817624,234022906,246072706,257160621,267822833,278823015,301760581,339933247,418493949,449181770,510786259,590716642,651508183,777744402,914682365,1000422127,997897469,962488416,959300462,897811233,775907905,722017259,756478652,788525662,813731058,840608505,844167552,867762818,909174821,934724297,965741060,1002916227,1051280908,1083354897,1138826915,1203214765,1255926409,1250530486,1322433781,1491953134,1709371086,1906665033,1961943172,2005861900,1976913105,2170832085,2318720178,2638237199,2776109588,2949238467,2909653173,2956537719,2993054674,3032752620,3075150919,3108826924]
[null,null,"Real estate assets                                                                                                                 ",123280105,129097425,134614477,142353253,150485891,161524641,171233350,180942601,189388755,195309483,202418081,217562382,243002153,298300207,335556227,383559733,456539435,509308292,601773349,706063787,782820207,785561830,750023254,753422019,661750215,586183371,542407976,563678551,582311234,600132424,619149240,624769057,640790780,677577858,704137650,740491453,769535891,808228878,840421562,886981055,946427649,996242486,1003708881,1016350076,1161561634,1372626160,1536641152,1548985369,1568551418,1560555911,1660113798,1802702005,2073664481,2251001916,2383150407,2395363130,2443444432,2469495245,2519026381,2545995513,2575178351]
{"$rows_left_out":97}